Reaction Details
TargetSteroidogenic factor 1
LigandBDBM38860
Substrate/Competitorn/a
Meas. Tech.Dose-response cell-based assay for inhibitors of the nuclear receptor Steroidogenic Factor 1 (SF-1)
IC50 4395±n/a nM
Citation PubChem, PC Dose-response cell-based assay for inhibitors of the nuclear receptor Steroidogenic Factor 1 (SF-1) PubChem Bioassay(2007)[AID]
 
Steroidogenic factor 1
Name:Steroidogenic factor 1
Type:Nuclear Hormone Receptor
Mol. Mass.:51643.43
Organism:Homo sapiens (Human)
Description:n/a
Residue:461
BDBM38860
NameBDBM38860
Synonyms:1-(2,3-Dihydro-indol-1-yl)-2-[5-(quinolin-8-yloxymethyl)-[1,3,4]oxadiazol-2-ylsulfanyl]-ethanone 1-(2,3-dihydroindol-1-yl)-2-[[5-(quinolin-8-yloxymethyl)-1,3,4-oxadiazol-2-yl]sulfanyl]ethanone MLS000077428 cid_651099
TypeSmall organic molecule
Emp. Form.C22H18N4O3S
Mol. Mass.418.468
SMILESO=C(CSc1nnc(COc2cccc3cccnc23)o1)N1CCc2ccccc12