Reaction Details
TargetSteroidogenic factor 1
LigandBDBM38993
Substrate/Competitorn/a
Meas. Tech.Dose-response cell-based assay for inhibitors of the nuclear receptor Steroidogenic Factor 1 (SF-1)
IC50 1296±n/a nM
Citation PubChem, PC Dose-response cell-based assay for inhibitors of the nuclear receptor Steroidogenic Factor 1 (SF-1) PubChem Bioassay(2007)[AID]
 
Steroidogenic factor 1
Name:Steroidogenic factor 1
Type:Nuclear Hormone Receptor
Mol. Mass.:51643.43
Organism:Homo sapiens (Human)
Description:n/a
Residue:461
BDBM38993
NameBDBM38993
Synonyms:(1Z,3Z)-1,4-bis(butylsulfonyl)buta-1,3-diene SMR000020833 | cid_5286934
TypeSmall organic molecule
Emp. Form.C12H22O4S2
Mol. Mass.294.431
SMILESCCCCS(=O)(=O)\C=C/C=C\S(=O)(=O)CCCC