Reaction Details
TargetSteroidogenic factor 1
LigandBDBM38998
Substrate/Competitorn/a
Meas. Tech.Dose-response cell-based assay for inhibitors of the nuclear receptor Steroidogenic Factor 1 (SF-1)
IC50 98±n/a nM
Citation PubChem, PC Dose-response cell-based assay for inhibitors of the nuclear receptor Steroidogenic Factor 1 (SF-1) PubChem Bioassay(2007)[AID]
 
Steroidogenic factor 1
Name:Steroidogenic factor 1
Type:Nuclear Hormone Receptor
Mol. Mass.:51643.43
Organism:Homo sapiens (Human)
Description:n/a
Residue:461
BDBM38998
NameBDBM38998
Synonyms:MLS000064750 N-(3-cyano-5,6,7,8-tetrahydro-4H-cyclohepta[b]thiophen-2-yl)-2-(1H-1,2,4-triazol-5-ylsulfanyl)acetamide N-(3-cyano-5,6,7,8-tetrahydro-4H-cyclohepta[b]thiophen-2-yl)-2-(1H-1,2,4-triazol-5-ylthio)acetamide cid_972733
TypeSmall organic molecule
Emp. Form.C14H15N5OS2
Mol. Mass.333.432
SMILESO=C(CSc1nnc[nH]1)Nc1sc2CCCCCc2c1C#N