Reaction Details
TargetSteroidogenic factor 1
LigandBDBM39024
Substrate/Competitorn/a
Meas. Tech.Dose-response cell-based assay for inhibitors of the nuclear receptor Steroidogenic Factor 1 (SF-1)
IC50 547±n/a nM
Citation PubChem, PC Dose-response cell-based assay for inhibitors of the nuclear receptor Steroidogenic Factor 1 (SF-1) PubChem Bioassay(2007)[AID]
 
Steroidogenic factor 1
Name:Steroidogenic factor 1
Type:Nuclear Hormone Receptor
Mol. Mass.:51643.43
Organism:Homo sapiens (Human)
Description:n/a
Residue:461
BDBM39024
NameBDBM39024
Synonyms:3-[(2-chloro-4-methylol-phenoxy)methyl]benzoic acid 3-[[2-chloro-4-(hydroxymethyl)phenoxy]methyl]benzoic acid MLS000099276 cid_893460
TypeSmall organic molecule
Emp. Form.C15H13ClO4
Mol. Mass.292.714
SMILESOCc1ccc(OCc2cccc(c2)C(O)=O)c(Cl)c1