Reaction Details
TargetSteroidogenic factor 1
LigandBDBM37170
Substrate/Competitorn/a
Meas. Tech.Dose-response cell-based assay for inhibitors of the nuclear receptor Steroidogenic Factor 1 (SF-1)
IC50 18060±n/a nM
Citation PubChem, PC Dose-response cell-based assay for inhibitors of the nuclear receptor Steroidogenic Factor 1 (SF-1) PubChem Bioassay(2007)[AID]
 
Steroidogenic factor 1
Name:Steroidogenic factor 1
Type:Nuclear Hormone Receptor
Mol. Mass.:51643.43
Organism:Homo sapiens (Human)
Description:n/a
Residue:461
BDBM37170
NameBDBM37170
Synonyms:3-methyl-4-oxo-6-(3,4,5-trimethoxyphenyl)-1,5,6,7-tetrahydroindole-2-carboxylic acid prop-2-enyl ester MLS000116495 cid_5308217 prop-2-enyl 3-methyl-4-oxo-6-(3,4,5-trimethoxyphenyl)-1,5,6,7-tetrahydroindole-2-carboxylate
TypeSmall organic molecule
Emp. Form.C22H25NO6
Mol. Mass.399.437
SMILESCOc1cc(cc(OC)c1OC)C1Cc2[nH]c(C(=O)OCC=C)c(C)c2C(=O)C1