Reaction Details
TargetIsoform 2 of Nuclear receptor ROR-alpha (Alpha-2)
LigandBDBM38860
Substrate/Competitorn/a
Meas. Tech.Dose-response cell-based assay for inhibitors of the Retinoic Acid Receptor-related orphan receptor A (RORA)
IC50 1959±n/a nM
Citation PubChem, PC Dose-response cell-based assay for inhibitors of the Retinoic Acid Receptor-related orphan receptor A (RORA) PubChem Bioassay(2007)[AID]
 
Isoform 2 of Nuclear receptor ROR-alpha (Alpha-2)
Name:Isoform 2 of Nuclear receptor ROR-alpha (Alpha-2)
Type:PROTEIN
Mol. Mass.:63033.59
Organism:Homo sapiens (Human)
Description:EBI_101591
Residue:556
BDBM38860
NameBDBM38860
Synonyms:1-(2,3-Dihydro-indol-1-yl)-2-[5-(quinolin-8-yloxymethyl)-[1,3,4]oxadiazol-2-ylsulfanyl]-ethanone 1-(2,3-dihydroindol-1-yl)-2-[[5-(quinolin-8-yloxymethyl)-1,3,4-oxadiazol-2-yl]sulfanyl]ethanone MLS000077428 cid_651099
TypeSmall organic molecule
Emp. Form.C22H18N4O3S
Mol. Mass.418.468
SMILESO=C(CSc1nnc(COc2cccc3cccnc23)o1)N1CCc2ccccc12