Reaction Details
TargetIsoform 2 of Nuclear receptor ROR-alpha (Alpha-2)
LigandBDBM38935
Substrate/Competitorn/a
Meas. Tech.Dose-response cell-based assay for inhibitors of the Retinoic Acid Receptor-related orphan receptor A (RORA)
IC50<5.03±n/a nM
Citation PubChem, PC Dose-response cell-based assay for inhibitors of the Retinoic Acid Receptor-related orphan receptor A (RORA) PubChem Bioassay(2007)[AID]
 
Isoform 2 of Nuclear receptor ROR-alpha (Alpha-2)
Name:Isoform 2 of Nuclear receptor ROR-alpha (Alpha-2)
Type:PROTEIN
Mol. Mass.:63033.59
Organism:Homo sapiens (Human)
Description:EBI_101591
Residue:556
BDBM38935
NameBDBM38935
Synonyms:2-(1-ethyl-2-methyl-5-benzimidazolyl)-5H-[1,2,4]triazolo[5,1-a]isoindole 2-(1-ethyl-2-methyl-benzimidazol-5-yl)-5H-[1,2,4]triazolo[5,1-a]isoindole MLS000054270 cid_2347892
TypeSmall organic molecule
Emp. Form.C19H17N5
Mol. Mass.315.3718
SMILESCCn1c(C)nc2cc(ccc12)-c1nc2-c3ccccc3Cn2n1