Reaction Details
TargetIsoform 2 of Nuclear receptor ROR-alpha (Alpha-2)
LigandBDBM38939
Substrate/Competitorn/a
Meas. Tech.Dose-response cell-based assay for inhibitors of the Retinoic Acid Receptor-related orphan receptor A (RORA)
IC50 1449±n/a nM
Citation PubChem, PC Dose-response cell-based assay for inhibitors of the Retinoic Acid Receptor-related orphan receptor A (RORA) PubChem Bioassay(2007)[AID]
 
Isoform 2 of Nuclear receptor ROR-alpha (Alpha-2)
Name:Isoform 2 of Nuclear receptor ROR-alpha (Alpha-2)
Type:PROTEIN
Mol. Mass.:63033.59
Organism:Homo sapiens (Human)
Description:EBI_101591
Residue:556
BDBM38939
NameBDBM38939
Synonyms:(4E)-3-hydroxy-4-[[(4-methyl-2-methylimino-1,3-thiazol-3-yl)amino]methylidene]cyclohexa-2,5-dien-1-one (4E)-3-hydroxy-4-[[(4-methyl-2-methylimino-4-thiazolin-3-yl)amino]methylene]cyclohexa-2,5-dien-1-one MLS000096544 cid_5742517
TypeSmall organic molecule
Emp. Form.C12H13N3O2S
Mol. Mass.263.316
SMILESCN=c1scc(C)n1N=Cc1ccc(O)cc1O