Reaction Details
TargetIsoform 2 of Nuclear receptor ROR-alpha (Alpha-2)
LigandBDBM38994
Substrate/Competitorn/a
Meas. Tech.Dose-response cell-based assay for inhibitors of the Retinoic Acid Receptor-related orphan receptor A (RORA)
IC50 727±n/a nM
Citation PubChem, PC Dose-response cell-based assay for inhibitors of the Retinoic Acid Receptor-related orphan receptor A (RORA) PubChem Bioassay(2007)[AID]
 
Isoform 2 of Nuclear receptor ROR-alpha (Alpha-2)
Name:Isoform 2 of Nuclear receptor ROR-alpha (Alpha-2)
Type:PROTEIN
Mol. Mass.:63033.59
Organism:Homo sapiens (Human)
Description:EBI_101591
Residue:556
BDBM38994
NameBDBM38994
Synonyms:MLS000089367 N-(2-methoxyethyl)-2-[[5-methyl-2-(4-methylsulfanylphenyl)-1,3-oxazol-4-yl]methylsulfanyl]acetamide N-(2-methoxyethyl)-2-[[5-methyl-2-[4-(methylthio)phenyl]-4-oxazolyl]methylthio]acetamide SMR000027742 | cid_3245395
TypeSmall organic molecule
Emp. Form.C17H22N2O3S2
Mol. Mass.366.498
SMILESCOCCNC(=O)CSCc1nc(oc1C)-c1ccc(SC)cc1