Reaction Details
TargetIsoform 2 of Nuclear receptor ROR-alpha (Alpha-2)
LigandBDBM39001
Substrate/Competitorn/a
Meas. Tech.Dose-response cell-based assay for inhibitors of the Retinoic Acid Receptor-related orphan receptor A (RORA)
IC50 225±n/a nM
Citation PubChem, PC Dose-response cell-based assay for inhibitors of the Retinoic Acid Receptor-related orphan receptor A (RORA) PubChem Bioassay(2007)[AID]
 
Isoform 2 of Nuclear receptor ROR-alpha (Alpha-2)
Name:Isoform 2 of Nuclear receptor ROR-alpha (Alpha-2)
Type:PROTEIN
Mol. Mass.:63033.59
Organism:Homo sapiens (Human)
Description:EBI_101591
Residue:556
BDBM39001
NameBDBM39001
Synonyms:3-[(4-ethoxyphenoxy)methyl]benzoic acid SMR000072768 | cid_891145
TypeSmall organic molecule
Emp. Form.C16H16O4
Mol. Mass.272.2958
SMILESCCOc1ccc(OCc2cccc(c2)C(O)=O)cc1