Reaction Details
TargetIsoform 2 of Nuclear receptor ROR-alpha (Alpha-2)
LigandBDBM39004
Substrate/Competitorn/a
Meas. Tech.Dose-response cell-based assay for inhibitors of the Retinoic Acid Receptor-related orphan receptor A (RORA)
IC50 1375±n/a nM
Citation PubChem, PC Dose-response cell-based assay for inhibitors of the Retinoic Acid Receptor-related orphan receptor A (RORA) PubChem Bioassay(2007)[AID]
 
Isoform 2 of Nuclear receptor ROR-alpha (Alpha-2)
Name:Isoform 2 of Nuclear receptor ROR-alpha (Alpha-2)
Type:PROTEIN
Mol. Mass.:63033.59
Organism:Homo sapiens (Human)
Description:EBI_101591
Residue:556
BDBM39004
NameBDBM39004
Synonyms:2-[5-(1,3-benzodioxol-5-yl)-1,2,4-oxadiazol-3-yl]pyridine 5-(1,3-benzodioxol-5-yl)-3-(2-pyridyl)-1,2,4-oxadiazole MLS000062381 cid_892017
TypeSmall organic molecule
Emp. Form.C14H9N3O3
Mol. Mass.267.2396
SMILESC1Oc2ccc(cc2O1)-c1nc(no1)-c1ccccn1