Reaction Details
TargetIsoform 2 of Nuclear receptor ROR-alpha (Alpha-2)
LigandBDBM39028
Substrate/Competitorn/a
Meas. Tech.Dose-response cell-based assay for inhibitors of the Retinoic Acid Receptor-related orphan receptor A (RORA)
IC50 538±n/a nM
Citation PubChem, PC Dose-response cell-based assay for inhibitors of the Retinoic Acid Receptor-related orphan receptor A (RORA) PubChem Bioassay(2007)[AID]
 
Isoform 2 of Nuclear receptor ROR-alpha (Alpha-2)
Name:Isoform 2 of Nuclear receptor ROR-alpha (Alpha-2)
Type:PROTEIN
Mol. Mass.:63033.59
Organism:Homo sapiens (Human)
Description:EBI_101591
Residue:556
BDBM39028
NameBDBM39028
Synonyms:3-[(2-chloranylphenoxy)methyl]benzoic acid MLS000063414 cid_584778
TypeSmall organic molecule
Emp. Form.C14H11ClO3
Mol. Mass.262.688
SMILESOC(=O)c1cccc(COc2ccccc2Cl)c1