Reaction Details
TargetSteroidogenic factor 1
LigandBDBM38856
Substrate/Competitorn/a
Meas. Tech.Counterscreen for inhibitors of the Retinoic Acid Receptor-related orphan receptor A (RORA): A cell-based dose-response assay for inhibition of the Steroidogenic Factor 1 (SF-1)
IC50 892±n/a nM
Citation PubChem, PC Counterscreen for inhibitors of the Retinoic Acid Receptor-related orphan receptor A (RORA): A cell-based dose-response assay for inhibition of the Steroidogenic Factor 1 (SF-1) PubChem Bioassay(2007)[AID]
 
Steroidogenic factor 1
Name:Steroidogenic factor 1
Type:Nuclear Hormone Receptor
Mol. Mass.:51643.43
Organism:Homo sapiens (Human)
Description:n/a
Residue:461
BDBM38856
NameBDBM38856
Synonyms:2,6-Dimethyl-benzo[1,2-b;4,5-b']difuran-3,7-dicarboxylic acid bis-(2-dimethylamino-ethyl) ester MLS000033569 bis[2-(dimethylamino)ethyl] 2,6-dimethylfuro[2,3-f][1]benzofuran-3,7-dicarboxylate | cid_650137
TypeSmall organic molecule
Emp. Form.C22H28N2O6
Mol. Mass.416.4675
SMILESCN(C)CCOC(=O)c1c(C)oc2cc3c(C(=O)OCCN(C)C)c(C)oc3cc12