Reaction Details
TargetSteroidogenic factor 1
LigandBDBM36913
Substrate/Competitorn/a
Meas. Tech.Counterscreen for inhibitors of the Retinoic Acid Receptor-related orphan receptor A (RORA): A cell-based dose-response assay for inhibition of the Steroidogenic Factor 1 (SF-1)
IC50>5.03±n/a nM
Citation PubChem, PC Counterscreen for inhibitors of the Retinoic Acid Receptor-related orphan receptor A (RORA): A cell-based dose-response assay for inhibition of the Steroidogenic Factor 1 (SF-1) PubChem Bioassay(2007)[AID]
 
Steroidogenic factor 1
Name:Steroidogenic factor 1
Type:Nuclear Hormone Receptor
Mol. Mass.:51643.43
Organism:Homo sapiens (Human)
Description:n/a
Residue:461
BDBM36913
NameBDBM36913
Synonyms:2-[(2,5-dimethyl-1-pyridin-2-yl-pyrrol-3-yl)methylidene]-[1,3]thiazolo[3,2-a]benzimidazol-1-one 2-[[2,5-dimethyl-1-(2-pyridinyl)-3-pyrrolyl]methylidene]-1-thiazolo[3,2-a]benzimidazolone MLS000036977 cid_661826
TypeSmall organic molecule
Emp. Form.C21H16N4OS
Mol. Mass.372.443
SMILESCc1cc(C=c2sc3nc4ccccc4n3c2=O)c(C)n1-c1ccccn1