Reaction Details
TargetSteroidogenic factor 1
LigandBDBM38914
Substrate/Competitorn/a
Meas. Tech.Counterscreen for inhibitors of the Retinoic Acid Receptor-related orphan receptor A (RORA): A cell-based dose-response assay for inhibition of the Steroidogenic Factor 1 (SF-1)
IC50 75±n/a nM
Citation PubChem, PC Counterscreen for inhibitors of the Retinoic Acid Receptor-related orphan receptor A (RORA): A cell-based dose-response assay for inhibition of the Steroidogenic Factor 1 (SF-1) PubChem Bioassay(2007)[AID]
 
Steroidogenic factor 1
Name:Steroidogenic factor 1
Type:Nuclear Hormone Receptor
Mol. Mass.:51643.43
Organism:Homo sapiens (Human)
Description:n/a
Residue:461
BDBM38914
NameBDBM38914
Synonyms:3-[3-(4-tert-butylphenyl)-1,2,4-oxadiazol-5-yl]-N-methyl-propanamide 3-[3-(4-tert-butylphenyl)-1,2,4-oxadiazol-5-yl]-N-methylpropanamide SMR000046910 | cid_665654
TypeSmall organic molecule
Emp. Form.C16H21N3O2
Mol. Mass.287.3568
SMILESCNC(=O)CCc1nc(no1)-c1ccc(cc1)C(C)(C)C