Reaction Details
TargetSteroidogenic factor 1
LigandBDBM38915
Substrate/Competitorn/a
Meas. Tech.Counterscreen for inhibitors of the Retinoic Acid Receptor-related orphan receptor A (RORA): A cell-based dose-response assay for inhibition of the Steroidogenic Factor 1 (SF-1)
IC50 41.66±n/a nM
Citation PubChem, PC Counterscreen for inhibitors of the Retinoic Acid Receptor-related orphan receptor A (RORA): A cell-based dose-response assay for inhibition of the Steroidogenic Factor 1 (SF-1) PubChem Bioassay(2007)[AID]
 
Steroidogenic factor 1
Name:Steroidogenic factor 1
Type:Nuclear Hormone Receptor
Mol. Mass.:51643.43
Organism:Homo sapiens (Human)
Description:n/a
Residue:461
BDBM38915
NameBDBM38915
Synonyms:3-[3-(4-tert-butylphenyl)-1,2,4-oxadiazol-5-yl]-N-ethyl-propanamide 3-[3-(4-tert-butylphenyl)-1,2,4-oxadiazol-5-yl]-N-ethylpropanamide SMR000047081 | cid_665747
TypeSmall organic molecule
Emp. Form.C17H23N3O2
Mol. Mass.301.3834
SMILESCCNC(=O)CCc1nc(no1)-c1ccc(cc1)C(C)(C)C