Reaction Details
TargetSteroidogenic factor 1
LigandBDBM37016
Substrate/Competitorn/a
Meas. Tech.Counterscreen for inhibitors of the Retinoic Acid Receptor-related orphan receptor A (RORA): A cell-based dose-response assay for inhibition of the Steroidogenic Factor 1 (SF-1)
IC50 841±n/a nM
Citation PubChem, PC Counterscreen for inhibitors of the Retinoic Acid Receptor-related orphan receptor A (RORA): A cell-based dose-response assay for inhibition of the Steroidogenic Factor 1 (SF-1) PubChem Bioassay(2007)[AID]
 
Steroidogenic factor 1
Name:Steroidogenic factor 1
Type:Nuclear Hormone Receptor
Mol. Mass.:51643.43
Organism:Homo sapiens (Human)
Description:n/a
Residue:461
BDBM37016
NameBDBM37016
Synonyms:MLS000056239 N-[2-[2-[2,5-dimethyl-1-(thiophen-2-ylmethyl)-3-pyrrolyl]-2-oxoethoxy]phenyl]acetamide N-[2-[2-[2,5-dimethyl-1-(thiophen-2-ylmethyl)pyrrol-3-yl]-2-oxoethoxy]phenyl]acetamide cid_2524461
TypeSmall organic molecule
Emp. Form.C21H22N2O3S
Mol. Mass.382.476
SMILESCC(=O)Nc1ccccc1OCC(=O)c1cc(C)n(Cc2cccs2)c1C