Reaction Details
TargetSteroidogenic factor 1
LigandBDBM38964
Substrate/Competitorn/a
Meas. Tech.Counterscreen for inhibitors of the Retinoic Acid Receptor-related orphan receptor A (RORA): A cell-based dose-response assay for inhibition of the Steroidogenic Factor 1 (SF-1)
IC50 370±n/a nM
Citation PubChem, PC Counterscreen for inhibitors of the Retinoic Acid Receptor-related orphan receptor A (RORA): A cell-based dose-response assay for inhibition of the Steroidogenic Factor 1 (SF-1) PubChem Bioassay(2007)[AID]
 
Steroidogenic factor 1
Name:Steroidogenic factor 1
Type:Nuclear Hormone Receptor
Mol. Mass.:51643.43
Organism:Homo sapiens (Human)
Description:n/a
Residue:461
BDBM38964
NameBDBM38964
Synonyms:3-[(4-methoxyphenoxy)methyl]benzoic acid SMR000020397 | cid_3238641
TypeSmall organic molecule
Emp. Form.C15H14O4
Mol. Mass.258.2693
SMILESCOc1ccc(OCc2cccc(c2)C(O)=O)cc1