Reaction Details
TargetSteroidogenic factor 1
LigandBDBM31068
Substrate/Competitorn/a
Meas. Tech.Counterscreen for inhibitors of the Retinoic Acid Receptor-related orphan receptor A (RORA): A cell-based dose-response assay for inhibition of the Steroidogenic Factor 1 (SF-1)
IC50 6411±n/a nM
Citation PubChem, PC Counterscreen for inhibitors of the Retinoic Acid Receptor-related orphan receptor A (RORA): A cell-based dose-response assay for inhibition of the Steroidogenic Factor 1 (SF-1) PubChem Bioassay(2007)[AID]
 
Steroidogenic factor 1
Name:Steroidogenic factor 1
Type:Nuclear Hormone Receptor
Mol. Mass.:51643.43
Organism:Homo sapiens (Human)
Description:n/a
Residue:461
BDBM31068
NameBDBM31068
Synonyms:2-(methylsulfonyl)-4-thien-2-yl-6-(trifluoromethyl)pyrimidine 2-methylsulfonyl-4-thiophen-2-yl-6-(trifluoromethyl)pyrimidine SMR000022589 cid_3245258
TypeSmall organic molecule
Emp. Form.C10H7F3N2O2S2
Mol. Mass.308.3
SMILESCS(=O)(=O)c1nc(cc(n1)C(F)(F)F)-c1cccs1