Reaction Details
TargetSteroidogenic factor 1
LigandBDBM21629
Substrate/Competitorn/a
Meas. Tech.Counterscreen for inhibitors of the Retinoic Acid Receptor-related orphan receptor A (RORA): A cell-based dose-response assay for inhibition of the Steroidogenic Factor 1 (SF-1)
IC50 2622±n/a nM
Citation PubChem, PC Counterscreen for inhibitors of the Retinoic Acid Receptor-related orphan receptor A (RORA): A cell-based dose-response assay for inhibition of the Steroidogenic Factor 1 (SF-1) PubChem Bioassay(2007)[AID]
 
Steroidogenic factor 1
Name:Steroidogenic factor 1
Type:Nuclear Hormone Receptor
Mol. Mass.:51643.43
Organism:Homo sapiens (Human)
Description:n/a
Residue:461
BDBM21629
NameBDBM21629
Synonyms:3-(4-methylphenyl)-5H-indeno[1,2-c]pyridazin-5-one cid_2767330
TypeSmall organic molecule
Emp. Form.C18H12N2O
Mol. Mass.272.3007
SMILESCc1ccc(cc1)-c1cc2C(=O)c3ccccc3-c2nn1