Reaction Details
TargetBcl-2-related protein A1
LigandBDBM39119
Substrate/Competitorn/a
Meas. Tech.TR-FRET secondary assay for HTS discovery of chemical inhibitors of anti-apoptotic protein Bfl-1
IC50 1300±140 nM
Citation PubChem, PC TR-FRET secondary assay for HTS discovery of chemical inhibitors of anti-apoptotic protein Bfl-1 PubChem Bioassay(2008)[AID]
 
Bcl-2-related protein A1
Name:Bcl-2-related protein A1
Type:Apoptosis regulator protein
Mol. Mass.:19909.74
Organism:Mus musculus (Mouse)
Description:gi_11024684
Residue:172
BDBM39119
NameBDBM39119
Synonyms:3-chloranyl-1-(3,4-dichlorophenyl)-4-piperidin-1-yl-pyrrole-2,5-dione 3-chloro-1-(3,4-dichlorophenyl)-4-(piperidino)-1H-pyrrole-2,5-dione 3-chloro-1-(3,4-dichlorophenyl)-4-piperidino-3-pyrroline-2,5-quinone MLS-0066990.0001 | cid_1180675
TypeSmall organic molecule
Emp. Form.C15H13Cl3N2O2
Mol. Mass.359.635
SMILESClC1=C(N2CCCCC2)C(=O)N(C1=O)c1ccc(Cl)c(Cl)c1