Reaction Details
TargetBcl-2-related protein A1
LigandBDBM39120
Substrate/Competitorn/a
Meas. Tech.TR-FRET secondary assay for HTS discovery of chemical inhibitors of anti-apoptotic protein Bfl-1
IC50 1290±170 nM
Citation PubChem, PC TR-FRET secondary assay for HTS discovery of chemical inhibitors of anti-apoptotic protein Bfl-1 PubChem Bioassay(2008)[AID]
 
Bcl-2-related protein A1
Name:Bcl-2-related protein A1
Type:Apoptosis regulator protein
Mol. Mass.:19909.74
Organism:Mus musculus (Mouse)
Description:gi_11024684
Residue:172
BDBM39120
NameBDBM39120
Synonyms:3-chloranyl-1-(3,4-dichlorophenyl)-4-morpholin-4-yl-pyrrole-2,5-dione 3-chloro-1-(3,4-dichlorophenyl)-4-morpholin-4-ylpyrrole-2,5-dione MLS-0067124.0001 | cid_1074953
TypeSmall organic molecule
Emp. Form.C14H11Cl3N2O3
Mol. Mass.361.608
SMILESClC1=C(N2CCOCC2)C(=O)N(C1=O)c1ccc(Cl)c(Cl)c1