Reaction Details
TargetBcl-2-related protein A1
LigandBDBM39132
Substrate/Competitorn/a
Meas. Tech.TR-FRET secondary assay for HTS discovery of chemical inhibitors of anti-apoptotic protein Bfl-1
IC50 740±40 nM
Citation PubChem, PC TR-FRET secondary assay for HTS discovery of chemical inhibitors of anti-apoptotic protein Bfl-1 PubChem Bioassay(2008)[AID]
 
Bcl-2-related protein A1
Name:Bcl-2-related protein A1
Type:Apoptosis regulator protein
Mol. Mass.:19909.74
Organism:Mus musculus (Mouse)
Description:gi_11024684
Residue:172
BDBM39132
NameBDBM39132
Synonyms:3,4-bis(chloranyl)-1-(2,4-dichlorophenyl)pyrrole-2,5-dione 3,4-dichloro-1-(2,4-dichlorophenyl)pyrrole-2,5-dione cid_716793
TypeSmall organic molecule
Emp. Form.C10H3Cl4NO2
Mol. Mass.310.948
SMILESClC1=C(Cl)C(=O)N(C1=O)c1ccc(Cl)cc1Cl