Reaction Details
TargetBcl-2-related protein A1
LigandBDBM39138
Substrate/Competitorn/a
Meas. Tech.TR-FRET secondary assay for HTS discovery of chemical inhibitors of anti-apoptotic protein Bfl-1
IC50 1660±110 nM
Citation PubChem, PC TR-FRET secondary assay for HTS discovery of chemical inhibitors of anti-apoptotic protein Bfl-1 PubChem Bioassay(2008)[AID]
 
Bcl-2-related protein A1
Name:Bcl-2-related protein A1
Type:Apoptosis regulator protein
Mol. Mass.:19909.74
Organism:Mus musculus (Mouse)
Description:gi_11024684
Residue:172
BDBM39138
NameBDBM39138
Synonyms:1-[3,5-bis(chloranyl)phenyl]-3-chloranyl-4-(4-methylpiperazin-1-yl)pyrrole-2,5-dione 3-chloro-1-(3,5-dichlorophenyl)-4-(4-methylpiperazin-1-yl)pyrrole-2,5-dione MLS-0090828.0001 | cid_1664226
TypeSmall organic molecule
Emp. Form.C15H14Cl3N3O2
Mol. Mass.374.65
SMILESCN1CCN(CC1)C1=C(Cl)C(=O)N(C1=O)c1cc(Cl)cc(Cl)c1