Reaction Details
TargetBcl-2-related protein A1
LigandBDBM39146
Substrate/Competitorn/a
Meas. Tech.TR-FRET secondary assay for HTS discovery of chemical inhibitors of anti-apoptotic protein Bfl-1
IC50 420±30 nM
Citation PubChem, PC TR-FRET secondary assay for HTS discovery of chemical inhibitors of anti-apoptotic protein Bfl-1 PubChem Bioassay(2008)[AID]
 
Bcl-2-related protein A1
Name:Bcl-2-related protein A1
Type:Apoptosis regulator protein
Mol. Mass.:19909.74
Organism:Mus musculus (Mouse)
Description:gi_11024684
Residue:172
BDBM39146
NameBDBM39146
Synonyms:3-chloranyl-1-(3,4-dichlorophenyl)-4-[4-[2-(2-hydroxyethyloxy)ethyl]piperazin-1-yl]pyrrole-2,5-dione 3-chloro-1-(3,4-dichlorophenyl)-4-[4-[2-(2-hydroxyethoxy)ethyl]-1-piperazinyl]pyrrole-2,5-dione 3-chloro-1-(3,4-dichlorophenyl)-4-[4-[2-(2-hydroxyethoxy)ethyl]piperazino]-3-pyrroline-2,5-quinone MLS-0090856.0001 | cid_16654652
TypeSmall organic molecule
Emp. Form.C18H20Cl3N3O4
Mol. Mass.448.728
SMILESOCCOCCN1CCN(CC1)C1=C(Cl)C(=O)N(C1=O)c1ccc(Cl)c(Cl)c1