Reaction Details
TargetBcl-2-related protein A1
LigandBDBM39147
Substrate/Competitorn/a
Meas. Tech.TR-FRET secondary assay for HTS discovery of chemical inhibitors of anti-apoptotic protein Bfl-1
IC50 1030±130 nM
Citation PubChem, PC TR-FRET secondary assay for HTS discovery of chemical inhibitors of anti-apoptotic protein Bfl-1 PubChem Bioassay(2008)[AID]
 
Bcl-2-related protein A1
Name:Bcl-2-related protein A1
Type:Apoptosis regulator protein
Mol. Mass.:19909.74
Organism:Mus musculus (Mouse)
Description:gi_11024684
Residue:172
BDBM39147
NameBDBM39147
Synonyms:3-chloranyl-1-(3,4-dichlorophenyl)-4-[(3R)-3-methylpiperazin-1-yl]pyrrole-2,5-dione 3-chloro-1-(3,4-dichlorophenyl)-4-[(3R)-3-methyl-1-piperazinyl]pyrrole-2,5-dione 3-chloro-1-(3,4-dichlorophenyl)-4-[(3R)-3-methylpiperazino]-3-pyrroline-2,5-quinone MLS-0090857.0001 | cid_16654653
TypeSmall organic molecule
Emp. Form.C15H14Cl3N3O2
Mol. Mass.374.65
SMILESC[C@@H]1CN(CCN1)C1=C(Cl)C(=O)N(C1=O)c1ccc(Cl)c(Cl)c1