Reaction Details
TargetBcl-2-related protein A1
LigandBDBM39149
Substrate/Competitorn/a
Meas. Tech.TR-FRET secondary assay for HTS discovery of chemical inhibitors of anti-apoptotic protein Bfl-1
IC50 730±50 nM
Citation PubChem, PC TR-FRET secondary assay for HTS discovery of chemical inhibitors of anti-apoptotic protein Bfl-1 PubChem Bioassay(2008)[AID]
 
Bcl-2-related protein A1
Name:Bcl-2-related protein A1
Type:Apoptosis regulator protein
Mol. Mass.:19909.74
Organism:Mus musculus (Mouse)
Description:gi_11024684
Residue:172
BDBM39149
NameBDBM39149
Synonyms:3-chloranyl-1-(3,4-dichlorophenyl)-4-[4-[(E)-3-phenylprop-2-enyl]piperazin-1-yl]pyrrole-2,5-dione 3-chloro-1-(3,4-dichlorophenyl)-4-[4-[(E)-3-phenylprop-2-enyl]piperazin-1-yl]pyrrole-2,5-dione 3-chloro-4-[4-[(E)-cinnamyl]piperazino]-1-(3,4-dichlorophenyl)-3-pyrroline-2,5-quinone MLS-0090859.0001 | cid_16654655
TypeSmall organic molecule
Emp. Form.C23H20Cl3N3O2
Mol. Mass.476.783
SMILESClC1=C(N2CCN(C\C=C\c3ccccc3)CC2)C(=O)N(C1=O)c1ccc(Cl)c(Cl)c1