Reaction Details
TargetBcl-2-related protein A1
LigandBDBM39150
Substrate/Competitorn/a
Meas. Tech.TR-FRET secondary assay for HTS discovery of chemical inhibitors of anti-apoptotic protein Bfl-1
IC50 970±50 nM
Citation PubChem, PC TR-FRET secondary assay for HTS discovery of chemical inhibitors of anti-apoptotic protein Bfl-1 PubChem Bioassay(2008)[AID]
 
Bcl-2-related protein A1
Name:Bcl-2-related protein A1
Type:Apoptosis regulator protein
Mol. Mass.:19909.74
Organism:Mus musculus (Mouse)
Description:gi_11024684
Residue:172
BDBM39150
NameBDBM39150
Synonyms:3-chloranyl-1-(3,4-dichlorophenyl)-4-(4-ethylpiperazin-1-yl)pyrrole-2,5-dione 3-chloro-1-(3,4-dichlorophenyl)-4-(4-ethylpiperazin-1-yl)pyrrole-2,5-dione MLS-0090860.0001 | cid_16654656
TypeSmall organic molecule
Emp. Form.C16H16Cl3N3O2
Mol. Mass.388.676
SMILESCCN1CCN(CC1)C1=C(Cl)C(=O)N(C1=O)c1ccc(Cl)c(Cl)c1