Reaction Details
TargetBcl-2-related protein A1
LigandBDBM39152
Substrate/Competitorn/a
Meas. Tech.TR-FRET secondary assay for HTS discovery of chemical inhibitors of anti-apoptotic protein Bfl-1
IC50 1640±200 nM
Citation PubChem, PC TR-FRET secondary assay for HTS discovery of chemical inhibitors of anti-apoptotic protein Bfl-1 PubChem Bioassay(2008)[AID]
 
Bcl-2-related protein A1
Name:Bcl-2-related protein A1
Type:Apoptosis regulator protein
Mol. Mass.:19909.74
Organism:Mus musculus (Mouse)
Description:gi_11024684
Residue:172
BDBM39152
NameBDBM39152
Synonyms:3-(4-benzylpiperazin-1-yl)-4-chloro-1-(3,4-dichlorophenyl)pyrrole-2,5-dione 3-chloranyl-1-(3,4-dichlorophenyl)-4-[4-(phenylmethyl)piperazin-1-yl]pyrrole-2,5-dione 3-chloro-1-(3,4-dichlorophenyl)-4-[4-(phenylmethyl)-1-piperazinyl]pyrrole-2,5-dione MLS-0090866.0001 | cid_16654662
TypeSmall organic molecule
Emp. Form.C21H18Cl3N3O2
Mol. Mass.450.746
SMILESClC1=C(N2CCN(Cc3ccccc3)CC2)C(=O)N(C1=O)c1ccc(Cl)c(Cl)c1