Reaction Details
TargetBcl-2-related protein A1
LigandBDBM39184
Substrate/Competitorn/a
Meas. Tech.TR-FRET secondary assay for HTS discovery of chemical inhibitors of anti-apoptotic protein Bfl-1
IC50 1460±150 nM
Citation PubChem, PC TR-FRET secondary assay for HTS discovery of chemical inhibitors of anti-apoptotic protein Bfl-1 PubChem Bioassay(2008)[AID]
 
Bcl-2-related protein A1
Name:Bcl-2-related protein A1
Type:Apoptosis regulator protein
Mol. Mass.:19909.74
Organism:Mus musculus (Mouse)
Description:gi_11024684
Residue:172
BDBM39184
NameBDBM39184
Synonyms:3,4-bis(chloranyl)-1-[4-(trifluoromethyl)phenyl]pyrrole-2,5-dione 3,4-dichloro-1-[4-(trifluoromethyl)phenyl]pyrrole-2,5-dione cid_16654869
TypeSmall organic molecule
Emp. Form.C11H4Cl2F3NO2
Mol. Mass.310.056
SMILESFC(F)(F)c1ccc(cc1)N1C(=O)C(Cl)=C(Cl)C1=O