Reaction Details
TargetM-phase inducer phosphatase 2
LigandBDBM32102
Substrate/Competitorn/a
Meas. Tech.Cdc25B Catalytic Domain Protein Tyrosine Phosphatase Probe Assessment Dose Response assay in the presence of Catalase.
IC50 23000±n/a nM
Citation PubChem, PC Cdc25B Catalytic Domain Protein Tyrosine Phosphatase Probe Assessment Dose Response assay in the presence of Catalase. PubChem Bioassay(2007)[AID]
 
M-phase inducer phosphatase 2
Name:M-phase inducer phosphatase 2
Type:Protein
Mol. Mass.:64985.27
Organism:Homo sapiens (Human)
Description:n/a
Residue:580
BDBM32102
NameBDBM32102
Synonyms:1,6-dimethylpyrimido[5,4-e][1,2,4]triazine-5,7(1H,6H)-dione 1,6-dimethylpyrimido[5,4-e][1,2,4]triazine-5,7-quinone SMR000024051 US9738628, Compound PKF118-310 | cid_66541
TypeSmall organic molecule
Emp. Form.C7H7N5O2
Mol. Mass.193.1628
SMILESCn1ncnc2c1nc(=O)n(C)c2=O