Reaction Details
TargetM-phase inducer phosphatase 2
LigandBDBM31758
Substrate/Competitorn/a
Meas. Tech.Cdc25B Catalytic Domain Protein Tyrosine Phosphatase Probe Assessment Dose Response assay in the presence of Beta-Mercaptoethanol.
IC50 5197±n/a nM
Citation PubChem, PC Cdc25B Catalytic Domain Protein Tyrosine Phosphatase Probe Assessment Dose Response assay in the presence of Beta-Mercaptoethanol. PubChem Bioassay(2007)[AID]
 
M-phase inducer phosphatase 2
Name:M-phase inducer phosphatase 2
Type:Protein
Mol. Mass.:64985.27
Organism:Homo sapiens (Human)
Description:n/a
Residue:580
BDBM31758
NameBDBM31758
Synonyms:8-methyl-3a,4,5,9b-tetrahydro-3H-cyclopenta[c]quinoline-4-carboxylic acid cid_646096
TypeSmall organic molecule
Emp. Form.C14H15NO2
Mol. Mass.229.2744
SMILESCc1ccc2NC(C3CC=CC3c2c1)C(O)=O