Reaction Details
TargetM-phase inducer phosphatase 2
LigandBDBM31755
Substrate/Competitorn/a
Meas. Tech.Cdc25B Catalytic Domain Protein Tyrosine Phosphatase Probe Assessment Dose Response assay in the presence of Beta-Mercaptoethanol.
IC50 10328±n/a nM
Citation PubChem, PC Cdc25B Catalytic Domain Protein Tyrosine Phosphatase Probe Assessment Dose Response assay in the presence of Beta-Mercaptoethanol. PubChem Bioassay(2007)[AID]
 
M-phase inducer phosphatase 2
Name:M-phase inducer phosphatase 2
Type:Protein
Mol. Mass.:64985.27
Organism:Homo sapiens (Human)
Description:n/a
Residue:580
BDBM31755
NameBDBM31755
Synonyms:3-(benzylthio)-5,6-bis(2-furyl)-1,2,4-triazine 5,6-bis(2-furanyl)-3-(phenylmethylthio)-1,2,4-triazine MLS-0029114.0001 | cid_2940938
TypeSmall organic molecule
Emp. Form.C18H13N3O2S
Mol. Mass.335.38
SMILESC(Sc1nnc(-c2ccco2)c(n1)-c1ccco1)c1ccccc1