Reaction Details
TargetDual specificity protein phosphatase 6
LigandBDBM32061
Substrate/Competitorn/a
Meas. Tech.Cdc25B Catalytic Domain Protein Tyrosine Phosphatase Probe Assessment: MKP-3 Dose Response Selectivity comparison.
IC50 3707±n/a nM
Citation PubChem, PC Cdc25B Catalytic Domain Protein Tyrosine Phosphatase Probe Assessment: MKP-3 Dose Response Selectivity comparison. PubChem Bioassay(2007)[AID]
 
Dual specificity protein phosphatase 6
Name:Dual specificity protein phosphatase 6
Type:Enzyme
Mol. Mass.:42303.19
Organism:Rattus norvegicus
Description:gi_16758752
Residue:381
BDBM32061
NameBDBM32061
Synonyms:1,8-bis(azanyl)-3,6-dipyrrolidin-1-yl-2,7-naphthyridine-4-carbonitrile 1,8-diamino-3,6-dipyrrolidin-1-yl-2,7-naphthyridine-4-carbonitrile MLS000054131 cid_2997948
TypeSmall organic molecule
Emp. Form.C17H21N7
Mol. Mass.323.3955
SMILESNc1nc(cc2c(C#N)c(nc(N)c12)N1CCCC1)N1CCCC1