Reaction Details
TargetDual specificity protein phosphatase 1
LigandBDBM31758
Substrate/Competitorn/a
Meas. Tech.Cdc25B Catalytic Domain Protein Tyrosine Phosphatase Probe Assessment: MKP-1 Dose Response Selectivity comparison.
IC50>50000±n/a nM
Citation PubChem, PC Cdc25B Catalytic Domain Protein Tyrosine Phosphatase Probe Assessment: MKP-1 Dose Response Selectivity comparison. PubChem Bioassay(2007)[AID]
 
Dual specificity protein phosphatase 1
Name:Dual specificity protein phosphatase 1
Type:Protein phosphatase
Mol. Mass.:39301.48
Organism:Homo sapiens (Human)
Description:gi_4758204
Residue:367
BDBM31758
NameBDBM31758
Synonyms:8-methyl-3a,4,5,9b-tetrahydro-3H-cyclopenta[c]quinoline-4-carboxylic acid cid_646096
TypeSmall organic molecule
Emp. Form.C14H15NO2
Mol. Mass.229.2744
SMILESCc1ccc2NC(C3CC=CC3c2c1)C(O)=O