Reaction Details
TargetDual specificity protein phosphatase 1
LigandBDBM31704
Substrate/Competitorn/a
Meas. Tech.Cdc25B Catalytic Domain Protein Tyrosine Phosphatase Probe Assessment: MKP-1 Dose Response Selectivity comparison.
IC50>50000±n/a nM
Citation PubChem, PC Cdc25B Catalytic Domain Protein Tyrosine Phosphatase Probe Assessment: MKP-1 Dose Response Selectivity comparison. PubChem Bioassay(2007)[AID]
 
Dual specificity protein phosphatase 1
Name:Dual specificity protein phosphatase 1
Type:Protein phosphatase
Mol. Mass.:39301.48
Organism:Homo sapiens (Human)
Description:gi_4758204
Residue:367
BDBM31704
NameBDBM31704
Synonyms:MLS000050353 N-[2,3-bis(2-furanyl)-6-quinoxalinyl]-1-azepanecarboxamide N-[2,3-bis(furan-2-yl)quinoxalin-6-yl]azepane-1-carboxamide cid_2214811
TypeSmall organic molecule
Emp. Form.C23H22N4O3
Mol. Mass.402.4458
SMILESO=C(Nc1ccc2nc(-c3ccco3)c(nc2c1)-c1ccco1)N1CCCCCC1