Reaction Details
TargetAlkaline phosphatase, germ cell type
LigandBDBM39589
Substrate/Competitorn/a
Meas. Tech.Luminescent assay for HTS discovery of chemical inhibitors of placental alkaline phosphatase
IC50 1880±190 nM
Citation PubChem, PC Luminescent assay for HTS discovery of chemical inhibitors of placental alkaline phosphatase PubChem Bioassay(2007)[AID]
 
Alkaline phosphatase, germ cell type
Name:Alkaline phosphatase, germ cell type
Type:PROTEIN
Mol. Mass.:57374.31
Organism:Homo sapiens (Human)
Description:ChEMBL_29964
Residue:532
BDBM39589
NameBDBM39589
Synonyms:MLS000069150 cid_6603438
TypeSmall organic molecule
Emp. Form.C16H22ClN3OS
Mol. Mass.339.883
SMILESCl.CC1(C)Cc2c(CO1)sc1nc3CCCCCn3c(=N)c21