Reaction Details
TargetAlkaline phosphatase, germ cell type
LigandBDBM39600
Substrate/Competitorn/a
Meas. Tech.Luminescent assay for HTS discovery of chemical inhibitors of placental alkaline phosphatase
IC50 2110±210 nM
Citation PubChem, PC Luminescent assay for HTS discovery of chemical inhibitors of placental alkaline phosphatase PubChem Bioassay(2007)[AID]
 
Alkaline phosphatase, germ cell type
Name:Alkaline phosphatase, germ cell type
Type:PROTEIN
Mol. Mass.:57374.31
Organism:Homo sapiens (Human)
Description:ChEMBL_29964
Residue:532
BDBM39600
NameBDBM39600
Synonyms:MLS000048783 cid_943085
TypeSmall organic molecule
Emp. Form.C12H8N6
Mol. Mass.236.2321
SMILESc1nn(-c2ccccc2)c2ncn3cnnc3c12