Reaction Details
TargetAlkaline phosphatase, germ cell type
LigandBDBM50309563
Substrate/Competitorn/a
Meas. Tech.Luminescent assay for HTS discovery of chemical inhibitors of placental alkaline phosphatase
IC50 3140±370 nM
Citation PubChem, PC Luminescent assay for HTS discovery of chemical inhibitors of placental alkaline phosphatase PubChem Bioassay(2007)[AID]
 
Alkaline phosphatase, germ cell type
Name:Alkaline phosphatase, germ cell type
Type:PROTEIN
Mol. Mass.:57374.31
Organism:Homo sapiens (Human)
Description:ChEMBL_29964
Residue:532
BDBM50309563
NameBDBM50309563
Synonyms:2-(2-(3,4-dihydroxyphenyl)-2-oxoethylthio)-4-(methoxymethyl)-6-methylnicotinonitrile cid_586278
TypeSmall organic molecule
Emp. Form.C17H16N2O4S
Mol. Mass.344.385
SMILESCOCc1cc(C)nc(SCC(=O)c2ccc(O)c(O)c2)c1C#N