Reaction Details
TargetAlkaline phosphatase, germ cell type
LigandBDBM50237956
Substrate/Competitorn/a
Meas. Tech.Luminescent assay for HTS discovery of chemical inhibitors of placental alkaline phosphatase
IC50 1130±90 nM
Citation PubChem, PC Luminescent assay for HTS discovery of chemical inhibitors of placental alkaline phosphatase PubChem Bioassay(2007)[AID]
 
Alkaline phosphatase, germ cell type
Name:Alkaline phosphatase, germ cell type
Type:PROTEIN
Mol. Mass.:57374.31
Organism:Homo sapiens (Human)
Description:ChEMBL_29964
Residue:532
BDBM50237956
NameBDBM50237956
Synonyms:1-(3,4-dihydroxyphenyl)-2-(1-(4-methoxyphenyl)-1H-tetrazol-5-ylthio)ethanone cid_1515366
TypeSmall organic molecule
Emp. Form.C16H14N4O4S
Mol. Mass.358.372
SMILESCOc1ccc(cc1)-n1nnnc1SCC(=O)c1ccc(O)c(O)c1