Reaction Details
TargetAlkaline phosphatase, germ cell type
LigandBDBM39676
Substrate/Competitorn/a
Meas. Tech.Luminescent assay for HTS discovery of chemical inhibitors of placental alkaline phosphatase
IC50 999000±0 nM
Citation PubChem, PC Luminescent assay for HTS discovery of chemical inhibitors of placental alkaline phosphatase PubChem Bioassay(2007)[AID]
 
Alkaline phosphatase, germ cell type
Name:Alkaline phosphatase, germ cell type
Type:PROTEIN
Mol. Mass.:57374.31
Organism:Homo sapiens (Human)
Description:ChEMBL_29964
Residue:532
BDBM39676
NameBDBM39676
Synonyms:1-N,3-N-dibenzyl-4-chlorobenzene-1,3-disulfonamide 4-chloro-N1,N3-bis(phenylmethyl)benzene-1,3-disulfonamide N,N'-dibenzyl-4-chloro-1,3-benzenedisulfonamide SMR000135505 | cid_1356376
TypeSmall organic molecule
Emp. Form.C20H19ClN2O4S2
Mol. Mass.450.959
SMILESClc1ccc(cc1S(=O)(=O)NCc1ccccc1)S(=O)(=O)NCc1ccccc1