Reaction Details
TargetAlkaline phosphatase, germ cell type
LigandBDBM39759
Substrate/Competitorn/a
Meas. Tech.Luminescent assay for HTS discovery of chemical inhibitors of placental alkaline phosphatase
IC50 1520±140 nM
Citation PubChem, PC Luminescent assay for HTS discovery of chemical inhibitors of placental alkaline phosphatase PubChem Bioassay(2007)[AID]
 
Alkaline phosphatase, germ cell type
Name:Alkaline phosphatase, germ cell type
Type:PROTEIN
Mol. Mass.:57374.31
Organism:Homo sapiens (Human)
Description:ChEMBL_29964
Residue:532
BDBM39759
NameBDBM39759
Synonyms:2-[[5-(1,3-benzothiazol-2-ylsulfanylmethyl)-4-ethyl-1,2,4-triazol-3-yl]sulfanyl]-1-(3,4-dihydroxyphenyl)ethanone 2-[[5-[(1,3-benzothiazol-2-ylthio)methyl]-4-ethyl-1,2,4-triazol-3-yl]thio]-1-(3,4-dihydroxyphenyl)ethanone SMR000152983 | cid_2102207
TypeSmall organic molecule
Emp. Form.C20H18N4O3S3
Mol. Mass.458.577
SMILESCCn1c(CSc2nc3ccccc3s2)nnc1SCC(=O)c1ccc(O)c(O)c1