Reaction Details
TargetSteroidogenic factor 1
LigandBDBM39426
Substrate/Competitorn/a
Meas. Tech.Dose-response cell-based assay for activators of the nuclear receptor Steroidogenic Factor 1 (SF-1)
EC50 183±n/a nM
Citation PubChem, PC Dose-response cell-based assay for activators of the nuclear receptor Steroidogenic Factor 1 (SF-1) PubChem Bioassay(2007)[AID]
 
Steroidogenic factor 1
Name:Steroidogenic factor 1
Type:Nuclear Hormone Receptor
Mol. Mass.:51643.43
Organism:Homo sapiens (Human)
Description:n/a
Residue:461
BDBM39426
NameBDBM39426
Synonyms:7-amino-3-phenyl-6-pyrazolo[1,5-a]pyrimidinecarboxylic acid ethyl ester MLS000075211 cid_649053 ethyl 7-azanyl-3-phenyl-pyrazolo[1,5-a]pyrimidine-6-carboxylate
TypeSmall organic molecule
Emp. Form.C15H14N4O2
Mol. Mass.282.2973
SMILESCCOC(=O)c1cnc2c(cnn2c1N)-c1ccccc1