Reaction Details
TargetSteroidogenic factor 1
LigandBDBM39428
Substrate/Competitorn/a
Meas. Tech.Dose-response cell-based assay for activators of the nuclear receptor Steroidogenic Factor 1 (SF-1)
EC50 168±n/a nM
Citation PubChem, PC Dose-response cell-based assay for activators of the nuclear receptor Steroidogenic Factor 1 (SF-1) PubChem Bioassay(2007)[AID]
 
Steroidogenic factor 1
Name:Steroidogenic factor 1
Type:Nuclear Hormone Receptor
Mol. Mass.:51643.43
Organism:Homo sapiens (Human)
Description:n/a
Residue:461
BDBM39428
NameBDBM39428
Synonyms:5-Methyl-furan-2-carboxylic acid (5-benzyl-thiazol-2-yl)-amide 5-methyl-N-[5-(phenylmethyl)-2-thiazolyl]-2-furancarboxamide N-(5-benzyl-1,3-thiazol-2-yl)-5-methylfuran-2-carboxamide SMR000015228 | cid_652850
TypeSmall organic molecule
Emp. Form.C16H14N2O2S
Mol. Mass.298.36
SMILESCc1ccc(o1)C(=O)Nc1ncc(Cc2ccccc2)s1