Reaction Details
TargetSteroidogenic factor 1
LigandBDBM39480
Substrate/Competitorn/a
Meas. Tech.Dose-response cell-based assay for activators of the nuclear receptor Steroidogenic Factor 1 (SF-1)
EC50 138±n/a nM
Citation PubChem, PC Dose-response cell-based assay for activators of the nuclear receptor Steroidogenic Factor 1 (SF-1) PubChem Bioassay(2007)[AID]
 
Steroidogenic factor 1
Name:Steroidogenic factor 1
Type:Nuclear Hormone Receptor
Mol. Mass.:51643.43
Organism:Homo sapiens (Human)
Description:n/a
Residue:461
BDBM39480
NameBDBM39480
Synonyms:2-(1-tert-butyl-4-keto-pyrazolo[3,4-d]pyrimidin-5-yl)-N-(2-chlorobenzyl)acetamide 2-(1-tert-butyl-4-oxo-1,4-dihydro-5H-pyrazolo[3,4-d]pyrimidin-5-yl)-N-(2-chlorobenzyl)acetamide 2-(1-tert-butyl-4-oxopyrazolo[3,4-d]pyrimidin-5-yl)-N-[(2-chlorophenyl)methyl]acetamide SMR000029422 | cid_3243223
TypeSmall organic molecule
Emp. Form.C18H20ClN5O2
Mol. Mass.373.837
SMILESCC(C)(C)n1ncc2c1ncn(CC(=O)NCc1ccccc1Cl)c2=O