Reaction Details
TargetSteroidogenic factor 1
LigandBDBM39527
Substrate/Competitorn/a
Meas. Tech.Counterscreen for activators of the Retinoic Acid Receptor-related orphan receptor A (RORA): A cell-based dose-response assay for inhibition of the Steroidogenic Factor 1 (SF-1)
EC50 140±n/a nM
Citation PubChem, PC Counterscreen for activators of the Retinoic Acid Receptor-related orphan receptor A (RORA): A cell-based dose-response assay for inhibition of the Steroidogenic Factor 1 (SF-1) PubChem Bioassay(2007)[AID]
 
Steroidogenic factor 1
Name:Steroidogenic factor 1
Type:Nuclear Hormone Receptor
Mol. Mass.:51643.43
Organism:Homo sapiens (Human)
Description:n/a
Residue:461
BDBM39527
NameBDBM39527
Synonyms:MLS000070707 N-(6-ethoxy-1,3-benzothiazol-2-yl)pyrazinamide Pyrazine-2-carboxylic acid (6-ethoxy-benzothiazol-2-yl)-amide cid_655450
TypeSmall organic molecule
Emp. Form.C14H12N4O2S
Mol. Mass.300.336
SMILESCCOc1ccc2nc(NC(=O)c3cnccn3)sc2c1