Reaction Details
TargetSteroidogenic factor 1
LigandBDBM39534
Substrate/Competitorn/a
Meas. Tech.Counterscreen for activators of the Retinoic Acid Receptor-related orphan receptor A (RORA): A cell-based dose-response assay for inhibition of the Steroidogenic Factor 1 (SF-1)
EC50 252±n/a nM
Citation PubChem, PC Counterscreen for activators of the Retinoic Acid Receptor-related orphan receptor A (RORA): A cell-based dose-response assay for inhibition of the Steroidogenic Factor 1 (SF-1) PubChem Bioassay(2007)[AID]
 
Steroidogenic factor 1
Name:Steroidogenic factor 1
Type:Nuclear Hormone Receptor
Mol. Mass.:51643.43
Organism:Homo sapiens (Human)
Description:n/a
Residue:461
BDBM39534
NameBDBM39534
Synonyms:1-azepanyl-[4-(5-phenyl-1,3,4-oxadiazol-2-yl)phenyl]methanone SMR000034426 cid_661182
TypeSmall organic molecule
Emp. Form.C21H21N3O2
Mol. Mass.347.4103
SMILESO=C(N1CCCCCC1)c1ccc(cc1)-c1nnc(o1)-c1ccccc1