Reaction Details
TargetSteroidogenic factor 1
LigandBDBM39537
Substrate/Competitorn/a
Meas. Tech.Counterscreen for activators of the Retinoic Acid Receptor-related orphan receptor A (RORA): A cell-based dose-response assay for inhibition of the Steroidogenic Factor 1 (SF-1)
EC50 257±n/a nM
Citation PubChem, PC Counterscreen for activators of the Retinoic Acid Receptor-related orphan receptor A (RORA): A cell-based dose-response assay for inhibition of the Steroidogenic Factor 1 (SF-1) PubChem Bioassay(2007)[AID]
 
Steroidogenic factor 1
Name:Steroidogenic factor 1
Type:Nuclear Hormone Receptor
Mol. Mass.:51643.43
Organism:Homo sapiens (Human)
Description:n/a
Residue:461
BDBM39537
NameBDBM39537
Synonyms:MLS000077996 N-[5-(1-adamantyl)-1,3,4-thiadiazol-2-yl]-2-furancarboxamide SMR000018313 | cid_663488
TypeSmall organic molecule
Emp. Form.C17H19N3O2S
Mol. Mass.329.417
SMILES[H]C12CC3([H])CC([H])(C1)CC(C2)(C3)c1nnc(NC(=O)c2ccco2)s1