Reaction Details
TargetSteroidogenic factor 1
LigandBDBM39543
Substrate/Competitorn/a
Meas. Tech.Counterscreen for activators of the Retinoic Acid Receptor-related orphan receptor A (RORA): A cell-based dose-response assay for inhibition of the Steroidogenic Factor 1 (SF-1)
EC50 226±n/a nM
Citation PubChem, PC Counterscreen for activators of the Retinoic Acid Receptor-related orphan receptor A (RORA): A cell-based dose-response assay for inhibition of the Steroidogenic Factor 1 (SF-1) PubChem Bioassay(2007)[AID]
 
Steroidogenic factor 1
Name:Steroidogenic factor 1
Type:Nuclear Hormone Receptor
Mol. Mass.:51643.43
Organism:Homo sapiens (Human)
Description:n/a
Residue:461
BDBM39543
NameBDBM39543
Synonyms:3-(3-methoxyphenyl)-5-(2-thienyl)-1,2,4-oxadiazole MLS000083721 cid_665971
TypeSmall organic molecule
Emp. Form.C13H10N2O2S
Mol. Mass.258.296
SMILESCOc1cccc(c1)-c1noc(n1)-c1cccs1