Reaction Details
TargetSteroidogenic factor 1
LigandBDBM39548
Substrate/Competitorn/a
Meas. Tech.Counterscreen for activators of the Retinoic Acid Receptor-related orphan receptor A (RORA): A cell-based dose-response assay for inhibition of the Steroidogenic Factor 1 (SF-1)
EC50 129±n/a nM
Citation PubChem, PC Counterscreen for activators of the Retinoic Acid Receptor-related orphan receptor A (RORA): A cell-based dose-response assay for inhibition of the Steroidogenic Factor 1 (SF-1) PubChem Bioassay(2007)[AID]
 
Steroidogenic factor 1
Name:Steroidogenic factor 1
Type:Nuclear Hormone Receptor
Mol. Mass.:51643.43
Organism:Homo sapiens (Human)
Description:n/a
Residue:461
BDBM39548
NameBDBM39548
Synonyms:(2-phenyl-1,3-thiazol-4-yl)methyl 1-methylpyrrole-2-carboxylate 1-methylpyrrole-2-carboxylic acid (2-phenylthiazol-4-yl)methyl ester SMR000063048 | cid_2091642
TypeSmall organic molecule
Emp. Form.C16H14N2O2S
Mol. Mass.298.36
SMILESCn1cccc1C(=O)OCc1csc(n1)-c1ccccc1